Citation
type: Class
comment: Natural language description of a software product from that products documentation, such as a web page.
comment: Beschreibung eines Softwareprodukts in natürlicher Sprache anhand der Produktdokumentation, z. B. einer Webseite. @de
subclass of: Tag