Classified
type: Class
comment: Klassifiziert einen Eintrag eines Katalogs, wie z.B. ein Merkmal oder eine Unternehmensfunktion. @de
comment: Classifies an entry of a catalogue, such as a feature or an enterprise function. Generic class that is only used as a superclass.
subclass of: Category