Enterprise Function Citation
source: https://www.doi.org/10.1007/978-1-84996-441-8
type: Class
comment: Natural language citation of an enterprise function, describes what acting human or machines have to do in certain enterprise to contribute to its mission or goals. An enterprise function is a directive in an institution on how to interpret data about entity types and then update data about entity types as a consequence of this interpretation. The citation is a term an author uses to describe the enterprise function that is supported by an application system.
comment: Das natürlichsprachliche Zitat einer Unternehmensfunktion beschreibt, was die handelnden Menschen oder Maschinen in einem bestimmten Unternehmen zu tun haben, um zu dessen Aufgabe oder Zielen beizutragen. Eine Unternehmensfunktion ist eine Richtlinie in einer Institution, wie Daten über Entitätstypen zu interpretieren sind und dann Daten über Entitätstypen als Folge dieser Interpretation zu aktualisieren sind. Das Zitat ist ein Begriff, den ein Autor verwendet, um die Unternehmensfunktion zu beschreiben, die durch ein Anwendungssystem unterstützt wird. @de
example: BahmniFuncBilling
example: BikaLimsFuncQualityControl
example: ElexisFuncAbrechnungssystem
subclass of: Citation