Quasi Experimental Study
type: Class
example: NamedStudy22
example: NamedStudy3
example: NamedStudy4
comment: Empirische Interventionsstudie ohne Randomisierung. @de
comment: empirical interventional study without randomization
subclass of: Study