User Group Citation
type: Class
comment: The natural language term an author uses for the user group of an application system.
comment: Der Begriff, den ein Autor für die Benutzergruppe eines Anwendungssystems verwendet. @de
example: OpenDentalUserDentist
example: OpenMrsUserAdministrativeStaff
example: OrthancUserNetworkEngineer
subclass of: Citation