Validation Study
type: Class
comment: Compares the accuracy of a measure with a gold standard measure.
comment: Vergleicht die Genauigkeit einer Messung mit einer Standardmessung. @de
subclass of: Study