internal identifier
type: DatatypeProperty
type: FunctionalProperty
comment: Internal identifier of a member of a catalogue. Unique inside a catalogue but duplicates may exist across different catalogues.
domain: Classified
range: string