supports classified function
type: ObjectProperty
comment: The classified enterprise function supported by the software feature.
sub property of: subClassifiedOf
domain: FeatureClassified
range: EnterpriseFunctionClassified